{"text_format":"1","workbook":"xlsx","n_sheets":14,"sheets":["Summary","Inputs","Output","Logic Flowchart","Logic Flowchart (2)","Calculations","Benchmark-Energy","Benchmark-Water","Benchmark-Adjustments","Performance Pyramid","Opportunity Library","Opp Library - PT","Drop-downs","NGERFactors"],"not_rendered":{"charts":10,"images":12,"macros":1,"external_links":0,"defined_names":11,"comments":5,"pivot_tables":6},"unopened":[],"bounds":{"document_bytes":16777216,"sheet_cells":100000,"rows_first":2000,"rows_last":500,"rows_between":2000,"halvings":0,"cell_chars":16384,"cell_head_chars":4096},"cells_cut":0,"cells_raw":0,"read":"whole","date_system":"1900"}

{"sheet":"Summary","index":0,"n_rows":39,"n_cols":3,"rows_kept":39,"cut":false,"hidden":false,"merged":[[38,1,38,3],[3,1,3,3],[37,1,37,3],[14,2,14,3],[15,2,15,3],[9,2,9,3],[10,2,10,3],[11,2,11,3],[12,2,12,3],[13,2,13,3],[7,2,7,3],[8,2,8,3]]}
[]
[null,"Energy and water benchmark model for a red meat processing plant"]
[]
[null,"AMPC engaged Energetics to construct a model of the energy and water use within a red meat processing plant. This model is designed for plant owners to benchmark their performance and assess the possible opportunities for improvement in water and energy performance."]
[]
[null,"Methodology"]
[null,"The methodology used to model a plant is:"]
[null,"1)","First the user provides input data on plant facilities, production, current energy and water usage and cost."]
[null,"2)","The production figures and energy and water consumption are used to calculate the performance of the user's plant across three metrics: thermal energy, electrical energy and water."]
[null,"3)","The model then retrieves a full-facility benchmark plant to compare to the user's plant for each of these metrics. Specifically, this plant has continuous rendering with no external product inputs. The energy and water use of this benchmark plant has been apportioned across its facilities as listed in the input sheet. This apportioning allows the model to adjust the full-facility benchmark plant to match the user's plant facilities and throughputs."]
[null,"4)","Before comparing the user's site to the benchmark plant, the user's performance figures are modified to account for the plant's species mix, production capacity and facility-level production adjustments: smaller species use different energy and water per tonne of production; a plant not at full production uses more energy and water per tonne of production; and, a plant with external rendering, or only diverting some production for boning or freezing will have a different energy and water profile for these facilities compared to the benchmark plant."]
[null,"5)","The user's modified performance figures are compared to the benchmark plant and ranked as poor, fair or good for each of the three metrics. Later, the results of these will be presented in a quantified dial-gauge figure."]
[null,"6)","The model imports an energy management framework. This framework is based on the rationale that for each metric a plant should implement straightforward performance improvement opportunities first, such as housekeeping, before considering more advanced opportunites, such as cogeneration. This staged approach is visualised as a layered pyramid, with each successive layer representing a more complex category of performance improvement opportunities."]
[null,"7)","Each metric of the user's plant is assigned to a layer of the pyramid based on the previous performance categorisation of poor, fair or good for that metric. For each metric, the final output report will present a description of this layer of performance improvements."]
[null,"8)","The model imports a library of performance improvement opportunities. This library contains a full range of performance improvement opportunities across all categories, but is then filtered to exclude opportunities outside of the plant's performance category for each metric. The model quantifies each opportunity based on the user's input data of energy and water usage and cost. This data is used to estimate the cost, savings and payback period. Opportunities exceeding the user's acceptable payback period are screened out."]
{"$rows_left_out":25}
{"sheet":"Inputs","index":1,"n_rows":84,"n_cols":22,"rows_kept":84,"cut":false,"hidden":false,"merged":[[83,21,83,22],[79,17,79,20],[80,17,80,20],[81,17,81,20],[82,17,82,20],[12,3,13,4],[11,3,11,4],[12,2,13,2],[76,2,78,2],[76,3,78,3],[76,4,78,4],[60,3,61,4],[11,13,11,14],[12,13,12,14],[14,13,14,14],[76,6,78,11],[2,2,2,18],[18,11,18,12],[47,15,48,17],[63,15,63,16],[64,15,64,16],[62,18,62,20],[63,18,63,20],[64,18,64,20],[54,6,54,7],[53,3,53,4],[17,11,17,12],[9,2,9,4],[73,15,73,21],[61,18,61,20],[65,15,65,16],[65,18,65,20],[62,15,62,16],[69,15,69,21],[69,10,72,10],[66,6,66,7],[67,6,67,7],[68,6,68,7],[11,11,11,12],[69,11,72,11],[12,11,12,12],[14,11,14,12],[16,11,16,12],[13,11,13,12],[15,11,15,12],[58,8,59,11],[60,11,61,11],[55,6,55,7],[16,13,16,14],[17,13,17,14],[15,13,15,14],[13,13,13,14],[73,6,73,7],[60,8,61,8],[60,6,61,7],[60,9,61,9],[60,10,61,10],[69,6,72,7],[69,8,72,8],[64,6,64,7],[65,6,65,7],[62,6,62,7],[63,6,63,7],[69,9,72,9],[74,6,74,7],[75,6,75,7],[79,6,79,7],[80,6,80,7],[81,6,81,7],[79,15,79,16],[80,15,80,16],[81,15,81,16],[82,15,82,16],[83,6,83,7],[82,6,82,7]]}
[]
[]
[null,null,"Energy and water benchmark model for a red meat processing plant"]
[]
[]
[null,null,"1. Facility data",null,null,null,null,null,"2. Production data"]
[]
[null,null,"What is the company and site name?",null,null,null,null,null,"What is the maximum production capacity of ",null,null,null,null,"What is the average HSCW per species for your plant?"]
[null,null,null,null,null,null,null,null,"your plant and current production for a year?",null,null,null,null,"If you don't supply figures the model will use default figures shown here."]
[null,null,"AMPC Member"]
[null,null,null,{"$f":"IF(OR(AND(D12=\"WA\",D13<>'Drop-downs'!U18,D13<>'Drop-downs'!U19),AND(D12=\"NT\",D13<>'Drop-downs'!U22,D13<>'Drop-downs'!U21)),\"Check electricity connection\",\"OK\")","v":"OK"},null,null,null,null,"Species","Maximum","Current","Units",null,"Default",null,"Your Plant","Figure Used"]
[null,null,"State/Territory","VIC",null,null,null,null,"Cattle","-",40000,"tHSCW / yr",null,284,null,null,{"$f":"IF(L12='Drop-downs'!$E$18,\"\",IF(IFERROR(AND(ISNUMBER(P12),P12>0),FALSE),P12,N12))","v":""}]
[null,null,"Electricity connection","Darwin Katherine Interconnected System",null,null,null,null,"Calves","-",null,"tHSCW / yr",null,158,null,null,{"$f":"IF(L13='Drop-downs'!$E$18,\"\",IF(IFERROR(AND(ISNUMBER(P13),P13>0),FALSE),P13,N13))","v":""}]
[null,null,null,null,null,null,null,null,"Pigs","-",null,"tHSCW / yr",null,72,null,null,{"$f":"IF(L14='Drop-downs'!$E$18,\"\",IF(IFERROR(AND(ISNUMBER(P14),P14>0),FALSE),P14,N14))","v":""}]
[null,null,"What facilities do you have in your plant?",null,null,null,null,null,"Sheep","-",null,"tHSCW / yr",null,48,null,null,{"$f":"IF(L15='Drop-downs'!$E$18,\"\",IF(IFERROR(AND(ISNUMBER(P15),P15>0),FALSE),P15,N15))","v":""}]
{"$rows_left_out":70}
{"sheet":"Output","index":2,"n_rows":101,"n_cols":8,"rows_kept":101,"cut":false,"hidden":false,"merged":[[1,1,1,2],[100,1,100,2],[15,3,15,4],[16,3,16,4],[17,3,17,4],[18,3,18,4],[19,3,19,4],[21,3,21,4],[22,5,22,6],[23,5,23,6],[24,5,24,6],[22,3,22,4],[23,3,23,4],[24,3,24,4],[21,5,21,6],[15,5,15,6],[16,5,16,6],[17,5,17,6],[18,5,18,6],[19,5,19,6]]}
[]
[null,{"$f":"HYPERLINK(\"#'Inputs'!$A$1\",\"LINK: Return to Inputs Page\")","v":"LINK: Return to Inputs Page"}]
[]
[null,{"$f":"\"Energy and water modeling results for \"&Inputs!C10","v":"Energy and water modeling results for AMPC Member"}]
[]
[null,"Benchmarking Results"]
[]
[]
[]
[]
[]
[]
[]
[]
[]
{"$rows_left_out":87}
{"sheet":"Logic Flowchart","index":3,"n_rows":98,"n_cols":17,"rows_kept":98,"cut":false,"hidden":true,"merged":[]}
[]
[]
[]
[]
[]
[]
[]
[]
[]
[]
[]
[]
[]
[]
[]
{"$rows_left_out":84}
{"sheet":"Logic Flowchart (2)","index":4,"n_rows":98,"n_cols":21,"rows_kept":98,"cut":false,"hidden":true,"merged":[]}
[]
[]
[]
[]
[]
[]
[]
[]
[]
[]
[]
[]
[]
[]
[]
{"$rows_left_out":84}
{"sheet":"Calculations","index":5,"n_rows":232,"n_cols":18,"rows_kept":232,"cut":false,"hidden":true,"merged":[[215,1,215,13],[202,8,202,9],[172,1,172,13],[203,1,205,1],[206,1,208,1],[209,1,211,1],[203,2,203,4],[204,2,204,4],[205,2,205,4],[206,2,206,4],[207,2,207,4],[208,2,208,4],[209,2,209,4],[210,2,210,4],[211,2,211,4],[187,2,187,3],[187,4,187,5],[184,2,184,4],[185,2,185,4],[183,7,183,8],[184,7,184,8],[185,7,185,8],[114,0,116,0],[111,0,113,0],[182,2,182,4],[182,7,182,8],[183,2,183,4]]}
[]
[null,null,"literature review reference required / needs QA"]
[null,null,"imports from another worksheet"]
[null,null,"exports to another worksheet"]
[null,null,"method step"]
[null,null,"heading"]
[]
[]
[]
[]
[null,"\"Calculate user's plant performance for each benchmark category\""]
[]
[null,"Method"]
[]
[null,"1) Convert consumption and cost values to SI units"]
{"$rows_left_out":218}
{"sheet":"Benchmark-Energy","index":6,"n_rows":144,"n_cols":53,"rows_kept":144,"cut":false,"hidden":true,"merged":[[69,11,70,11],[69,34,70,34],[69,14,70,14],[69,37,70,37],[140,19,140,22],[140,15,140,18],[139,15,139,22],[131,15,132,15],[131,16,132,18],[133,16,133,18],[134,16,134,18],[131,19,131,22],[132,19,132,20],[132,21,132,22]]}
[null,"Development of Energy Benchmarks"]
[]
[null,"Method"]
[]
[null,"1) From literature review, import typical energy use breakdown at a typical meat plant"]
[null,"2) Subdivide by plants with / without rendering and apply industry experience to apportion this energy use (hot water, steam, electricity) across the site facilities"]
[null,"3) From literature review, import figures for best-practice energy use at a full-facility plant"]
[null,"4) Import performance figures from real-world sites to cross-check best-practice figures for validation"]
[null,"5) From literature review, import spread of site performance to establish dial gauge range"]
[null,"6) Establish performance range within dial gauge range for poor, average and good performance"]
[]
[]
[{"$f":"B5","v":"1) From literature review, import typical energy use breakdown at a typical meat plant"},null,null,null,null,null,null,null,null,null,null,null,{"$f":"B6","v":"2) Subdivide by plants with / without rendering and apply industry experience to apportion this energy use (hot water, steam, electricity) across the site facilities"}]
[null,"Source: Eco-Efficiency Manual for Meat Processing, Meat and Livestock Australia Ltd, 2002"]
[null,null,null,null,null,null,null,null,null,null,null,null,null,"Rendering",null,null,null,null,null,null,null,null,null,null,null,null,null,null,null,null,null,null,null,null,null,null,"No rendering "]
{"$rows_left_out":130}
{"sheet":"Benchmark-Water","index":7,"n_rows":122,"n_cols":30,"rows_kept":122,"cut":false,"hidden":true,"merged":[[118,15,118,18],[117,15,117,18],[37,12,40,12],[27,11,40,11],[109,14,109,15],[34,12,36,12],[29,12,31,12],[32,12,33,12],[15,11,26,11],[15,12,18,12],[19,12,22,12],[23,12,26,12],[27,12,28,12]]}
[null,"Development of Water Benchmark"]
[]
[null,"Method"]
[]
[null,"1) From literature review, import typical water use breakdown at a typical meat plant"]
[null,"2) Apply industry experience to apportion this water use across the site facilities"]
[null,"3) From literature review, import figures for best-practice water use at a full-facility plant"]
[null,"4) Import performance figures from real-world sites to cross-check best-practice figures for validation"]
[null,"5) From literature review, import spread of site performance to establish dial gauge range"]
[null,"6) Establish performance range within dial gauge range for poor, average and good performance"]
[]
[{"$f":"B5","v":"1) From literature review, import typical water use breakdown at a typical meat plant"},null,null,null,null,null,null,null,null,null,null,{"$f":"B6","v":"2) Apply industry experience to apportion this water use across the site facilities"}]
[null,"Source: Eco-Efficiency Manual for Meat Processing, Meat and Livestock Australia Ltd, 2002"]
[]
[null,null,null,null,null,null,null,null,null,null,null,null,null,null,"kL / day",{"$f":"TRANSPOSE(Facilities_List)","v":"Stockyards"},"Slaughter and Evisceration","Hide Processing","Blood Processing","Rendering","Paunch Processing","Offal Washing","Wastewater Treatment","Chilling","Boning","Packaging","Freezing"]
{"$rows_left_out":108}
{"sheet":"Benchmark-Adjustments","index":8,"n_rows":201,"n_cols":23,"rows_kept":201,"cut":false,"hidden":true,"merged":[[169,1,169,4],[200,1,200,4],[49,3,49,5],[50,3,50,5],[51,3,51,5],[52,3,52,5],[142,1,142,4],[135,1,135,4],[49,6,49,8],[50,6,50,8],[51,6,51,8],[52,6,52,8],[135,6,135,9],[142,6,142,9],[147,14,147,17],[147,10,147,13],[135,10,135,13],[145,10,145,13],[145,14,145,17]]}
[null,"Development of Benchmark Adjustments"]
[]
[null,"Method"]
[]
[null,"1) From literature review, import figures to identify species-specific performance"]
[null,"2) Apply industry experience to calculate performance differences between large body and small body species"]
[null,"3) From industry experience, model plant performance for partial-capacity production"]
[]
[{"$f":"B5","v":"1) From literature review, import figures to identify species-specific performance"}]
[]
[null,null,"Energy",null,null,null,null,null,null,null,"Water"]
[]
[null,null,null,null,null,null,null,null,null,null,"Source: AMPC, Environmental Performance Review: Red Meat Processing Sector, 2015 §3.3 pp.9"]
[null,null,null,null,null,null,null,null,null,null,"http://www.ampc.com.au/2015/05/Environmental-Performance-Review-Red-Meat-Processing-Sector-2015"]
[]
{"$rows_left_out":187}
{"sheet":"Performance Pyramid","index":9,"n_rows":61,"n_cols":11,"rows_kept":61,"cut":false,"hidden":true,"merged":[[46,3,46,5],[46,2,47,2],[41,2,41,5],[46,6,46,8],[0,1,0,5]]}
[null,"\"For each benchmark category, place the site on the performance pyramid. Performance in each benchmark category determines the progression of the site up the performance pyramid for that category. That progression determines which improvement opportunities are screened: good performance screens out basic opportunities and vice-versa.\""]
[]
[null,"Method"]
[]
[null,"1) Using industry experience, establish a performance pyramid to categorise performance improvement opportunities"]
[null,"2) Categorise pyramid steps into performance bands and provide descriptions of performance improvement opportunities and next actions"]
[]
[]
[]
[{"$f":"B5","v":"1) Using industry experience, establish a performance pyramid to categorise performance improvement opportunities"}]
[]
[]
[]
[]
[]
{"$rows_left_out":47}
{"sheet":"Opportunity Library","index":10,"n_rows":107,"n_cols":56,"rows_kept":107,"cut":false,"hidden":true,"merged":[[19,38,19,40],[19,16,19,19],[19,33,19,37],[19,23,20,23],[19,24,19,26],[19,27,19,31],[1,1,1,7],[19,32,20,32],[18,2,18,7],[19,12,19,13],[19,14,19,15],[18,12,18,15],[18,8,18,11],[19,20,19,22]]}
[]
[null,"Quantify each improvement opportunity, first using default cost figures. Then, if user's cost data is available, modify savings and payback periods with these figures. Screen out opportunities that exceed the user's maximum payback threshold."]
[]
[null,"Method"]
[]
[null,"1) From literature review, import performance improvement opportunities"]
[null,"2) Categorise each according to performance pyramid"]
[null,"3) Identify area of saving (water, hot water, steam, electricity) and perform initial screening based on performance pyramid"]
[null,"4) Conduct further screening, based on the specifics of the opportunity"]
[null,"5) Quantify expected site savings (water, thermal, electricity, other) and typical payback period range"]
[null,"6) back-calculate saving metrics based on commodity rates (including modifying the payback period)"]
[null,"7) Conduct final screening for user's maximum payback period"]
[]
[]
[null,null,null,null,null,null,null,null,null,null,null,null,null,null,null,null,null,null,null,null,"Lower spread",-0.25]
{"$rows_left_out":93}
{"sheet":"Opp Library - PT","index":11,"n_rows":164,"n_cols":12,"rows_kept":164,"cut":false,"hidden":true,"merged":[[1,0,1,6]]}
[]
["Present benchmarking results and quantified improvement opportunities to the user. The top 4 opportunities that save the most cost per annum for each benchmark category are presented to the user."]
[]
["Method (presented in reverse due to the pivot tables and lookup formula)"]
[]
["1) create pivot tables of the opportunities list, applying filters to identify key metrics"]
["2) summarise these pivot tables via offest formula to make presentation to the end output sheet easier."]
["3) apply rounding to provide approximate savings figures to the end user so as not to offer false precision"]
[]
[]
[{"$f":"A8","v":"3) apply rounding to provide approximate savings figures to the end user so as not to offer false precision"}]
[]
[]
["number of significant figures for $ values:",2]
["number of significant figures for payback period:",1]
{"$rows_left_out":150}
{"sheet":"Drop-downs","index":12,"n_rows":57,"n_cols":28,"rows_kept":57,"cut":false,"hidden":true,"merged":[]}
[]
[null,null,"literature review reference required / needs QA"]
[null,null,"imported from another worksheet"]
[null,null,"exported to another worksheet"]
[null,null,"method step"]
[null,null,"heading"]
[]
[]
[]
[]
[]
[]
[]
[]
[]
{"$rows_left_out":43}
{"sheet":"NGERFactors","index":13,"n_rows":192,"n_cols":14,"rows_kept":192,"cut":false,"hidden":true,"merged":[[1,2,1,12],[94,4,94,5],[95,4,95,5],[90,6,92,6],[90,7,92,7],[90,8,92,8],[90,9,92,9],[93,4,93,5],[87,4,87,5],[88,4,88,5],[89,4,89,5],[90,3,92,3],[90,4,90,5],[91,4,91,5],[92,4,92,5],[82,4,82,5],[83,4,83,5],[84,4,84,5],[85,4,85,5],[86,4,86,5],[77,4,77,5],[78,4,78,5],[79,4,79,5],[80,4,80,5],[81,4,81,5],[72,4,72,5],[73,4,73,5],[74,4,74,5],[75,4,75,5],[76,4,76,5],[68,3,71,4],[68,5,71,5],[68,7,68,9],[69,7,69,9],[70,7,70,9],[38,9,38,10],[38,7,38,8],[38,5,38,6],[45,3,48,3],[45,4,48,4],[45,6,45,8],[46,6,46,8],[47,6,47,8],[36,5,36,6],[36,7,36,8],[36,9,36,10],[37,5,37,6],[37,7,37,8],[37,9,37,10],[34,5,34,6],[34,7,34,8],[34,9,34,10],[35,5,35,6],[35,7,35,8],[35,9,35,10],[32,5,32,6],[32,7,32,8],[32,9,32,10],[33,5,33,6],[33,7,33,8],[33,9,33,10],[30,5,30,6],[30,7,30,8],[30,9,30,10],[31,5,31,6],[31,7,31,8],[31,9,31,10],[28,5,28,6],[28,7,28,8],[28,9,28,10],[29,5,29,6],[29,7,29,8],[29,9,29,10],[19,6,19,7],[20,6,20,7],[26,5,26,6],[26,7,26,8],[26,9,26,10],[27,5,27,6],[27,7,27,8],[27,9,27,10],[25,5,25,6],[25,7,25,8],[25,9,25,10],[24,5,24,6],[24,7,24,8],[24,9,24,10],[11,2,11,12],[160,3,165,3],[139,3,149,3],[117,3,138,3],[153,3,157,3],[154,13,154,15],[150,3,151,3],[17,8,17,11],[18,8,18,11],[19,8,19,11],[20,8,20,9],[21,5,21,6],[21,7,21,8],[21,9,21,10],[22,5,22,6],[22,7,22,8],[22,9,22,10],[23,5,23,6],[23,7,23,8],[23,9,23,10],[17,3,20,3],[17,4,20,5],[17,6,17,7],[18,6,18,7],[172,3,172,4],[158,8,158,12],[166,8,166,12],[153,8,153,12],[101,8,101,12],[168,3,169,3],[103,3,116,3],[101,5,102,5],[101,6,102,7],[101,4,102,4]]}
[]
[null,null,"Sustainability Victoria - Assumptions in Tallow as a fuel paper"]
[]
[null,null,"Retrieved from: http://www.sustainability.vic.gov.au/publications-and-research/knowledge-archive/bioenergy"]
[null,null,"PDF: http://www.sustainability.vic.gov.au/-/media/resources/documents/publications-and-research/knowledge-archive/bioenergy-resource-in-victoria/archive-tallow-resource-assessment.pdf?la=en"]
[]
[null,null,"pp. 21, Table 3"]
[null,null,null,"Calorific Value (MJ/kg or GJ/tonne.) Tallow (Dry Basis)",null,"38.0 - 39.7",{"$f":"AVERAGE(38,39.7)","v":38.85},"GJ / tonne"]
[]
[]
[]
[null,null,"NGER Determination Factors"]
[]
[]
[]
{"$rows_left_out":177}